Target
Lysine-specific histone demethylase 1A
Ligand
BDBM501767
Substrate
Meas. Tech.
In Vitro Enzyme Inhibition Assay
IC50
550±n/a nM
Citation
 Chen, YKanouni, TStafford, JAVeal, J Inhibitors of lysine specific demethylase-1 US Patent  US11028066 Publication Date 6/8/2021 
Target
Name:
Lysine-specific histone demethylase 1A
Synonyms:
AOF2 Flavin-containing amine oxidase domain-containing protein 2 KDM1A KIAA0601 Lysine-specific demethylase 1 (LSD1) Lysine-specific histone demethylase 1 (LSD1)
Type:
Enzyme
Mol. Mass.:
92901.01
Organism:
Homo sapiens (Human)
Description:
O60341
Residue:
852
  
Inhibitor
Name:
BDBM501767
Synonyms:
4-[6-(4-amino-piperidin-1-yl)-4- methyl-5-oxo-4,5-dihydro- pyrazin-2-yl]-2-fluoro-benzonitrile | US11028066, Example 5
Type:
Small organic molecule
Emp. Form.:
C17H18FN5O
Mol. Mass.:
327.3561
SMILES:
Cn1cc(nc(N2CCC(N)CC2)c1=O)-c1ccc(C#N)c(F)c1
: