Target
Lysine-specific histone demethylase 1A
Ligand
BDBM501857
Substrate
Meas. Tech.
In Vitro Enzyme Inhibition Assay
IC50
5500±n/a nM
Citation
 Chen, YKanouni, TStafford, JAVeal, J Inhibitors of lysine specific demethylase-1 US Patent  US11028066 Publication Date 6/8/2021 
Target
Name:
Lysine-specific histone demethylase 1A
Synonyms:
AOF2 Flavin-containing amine oxidase domain-containing protein 2 KDM1A KIAA0601 Lysine-specific demethylase 1 (LSD1) Lysine-specific histone demethylase 1 (LSD1)
Type:
Enzyme
Mol. Mass.:
92901.01
Organism:
Homo sapiens (Human)
Description:
O60341
Residue:
852
  
Inhibitor
Name:
BDBM501857
Synonyms:
3-(4-aminopiperidin-1-yl)-5-[4-(hydroxymethyl)phenyl]- 1-methyl-6-(4-methylphenyl)pyrazin-2-one | US11028066, Example 95
Type:
Small organic molecule
Emp. Form.:
C24H28N4O2
Mol. Mass.:
404.5047
SMILES:
Cc1ccc(cc1)-c1c(nc(N2CCC(N)CC2)c(=O)n1C)-c1ccc(CO)cc1
: