Target
Thioredoxin reductase 1, cytoplasmic
Ligand
BDBM501862
Substrate
Meas. Tech.
Inhibition Assay
IC50
558±n/a nM
Citation
 Pelcman, BSuna, EStafford, WPriede, M Heteroarylsulfonyl-substituted pyridines and their use in the treatment of cancer US Patent  US11028067 Publication Date 6/8/2021 
Target
Name:
Thioredoxin reductase 1, cytoplasmic
Synonyms:
GRIM-12 Gene associated with retinoid-IFN-induced mortality 12 protein KM-102-derived reductase-like factor TRXR1_HUMAN Thioredoxin reductase 1 Thioredoxin reductase TR1
Type:
Protein
Mol. Mass.:
70761.78
Organism:
Homo sapiens (Human)
Description:
Q16881
Residue:
648
  
Inhibitor
Name:
BDBM501862
Synonyms:
US11028067, Example 3
Type:
Small organic molecule
Emp. Form.:
C12H12N4O4S
Mol. Mass.:
308.313
SMILES:
CN(C)c1ccc(c(n1)S(=O)(=O)c1ccccn1)[N+]([O-])=O
: