Target
Bromodomain-containing protein 4
Ligand
BDBM502276
Substrate
Meas. Tech.
Evaluation of BRD4 binding inhibition ability
IC50
4.00±n/a nM
Citation
 Lee, KChoi, GAli, ILee, JYLee, JSPark, WJKim, YTKim, SHKim, JHLim, J [1,2,4]Triazolo[4,3-a]quinoxaline derivative, method for preparing same, and pharmaceutical composition for preventing or treating BET protein-related diseases, containing same as active ingredient US Patent  US11028090 Publication Date 6/8/2021 
Target
Name:
Bromodomain-containing protein 4
Synonyms:
BRD4 Bromodomain-containing protein 4 (BRD4) Protein HUNK1
Type:
Protein
Mol. Mass.:
152264.84
Organism:
Homo sapiens (Human)
Description:
O60885
Residue:
1362
  
Inhibitor
Name:
BDBM502276
Synonyms:
US11028090, Example 161 | [4-(8- methoxy-1,6- dimethyl- [1,2,4]triazolo [4,3-a] quinoxaline-4- ylamino)- butyl]- carbamic acid isopropylester
Type:
Small organic molecule
Emp. Form.:
C20H28N6O3
Mol. Mass.:
400.4747
SMILES:
COc1cc(C)c2nc(NCCCCNC(=O)OC(C)C)c3nnc(C)n3c2c1
: