Target
Bromodomain-containing protein 4
Ligand
BDBM502641
Substrate
Meas. Tech.
Evaluation of BRD4 binding inhibition ability
IC50
5.00±n/a nM
Citation
 Lee, KChoi, GAli, ILee, JYLee, JSPark, WJKim, YTKim, SHKim, JHLim, J [1,2,4]Triazolo[4,3-a]quinoxaline derivative, method for preparing same, and pharmaceutical composition for preventing or treating BET protein-related diseases, containing same as active ingredient US Patent  US11028090 Publication Date 6/8/2021 
Target
Name:
Bromodomain-containing protein 4
Synonyms:
BRD4 Bromodomain-containing protein 4 (BRD4) Protein HUNK1
Type:
Protein
Mol. Mass.:
152264.84
Organism:
Homo sapiens (Human)
Description:
O60885
Residue:
1362
  
Inhibitor
Name:
BDBM502641
Synonyms:
N-{4-[7- (3,5- dimethyl- isoxazol-4- yl)-1- methyl- [1,2,4]triazolo [4,3-a] quinoxaline- 4-ylamino]- butyl}-3- | US11028090, Example 585
Type:
Small organic molecule
Emp. Form.:
C24H31N7O2
Mol. Mass.:
449.5486
SMILES:
CC(C)CC(=O)NCCCCNc1nc2cc(ccc2n2c(C)nnc12)-c1c(C)noc1C
: