Target
Tryptophan 5-hydroxylase 1
Ligand
BDBM445677
Substrate
Meas. Tech.
In Vitro Enzyme Activity Assay
IC50
34.0±8 nM
Citation
 Bader, MSpecker, EMatthes, SSchütz, AMallow, KGrohmann, MNazaré, M Xanthine derivatives, their use as a medicament, and pharmaceutical preparations comprising the same US Patent  US11028104 Publication Date 6/8/2021 
Target
Name:
Tryptophan 5-hydroxylase 1
Synonyms:
TPH TPH1_HUMAN TRPH | Tryptophan 5-monooxygenase 1
Type:
PROTEIN
Mol. Mass.:
50990.64
Organism:
Homo sapiens (Human)
Description:
ChEMBL_1361824
Residue:
444
  
Inhibitor
Name:
BDBM445677
Synonyms:
Ex. 15/KM-06-96/(I-15) US11028104, Example 15
Type:
Small organic molecule
Emp. Form.:
C24H22N8O2S
Mol. Mass.:
486.549
SMILES:
CCn1c2nc(Cc3cn4ccsc4n3)n(Cc3ccc(cc3)-c3ccn(C)n3)c2c(=O)[nH]c1=O
: