Target
Tryptophan 5-hydroxylase 1
Ligand
BDBM445682
Substrate
Meas. Tech.
In Vitro Enzyme Activity Assay
IC50
209±4 nM
Citation
 Bader, MSpecker, EMatthes, SSchütz, AMallow, KGrohmann, MNazaré, M Xanthine derivatives, their use as a medicament, and pharmaceutical preparations comprising the same US Patent  US11028104 Publication Date 6/8/2021 
Target
Name:
Tryptophan 5-hydroxylase 1
Synonyms:
TPH TPH1_HUMAN TRPH | Tryptophan 5-monooxygenase 1
Type:
PROTEIN
Mol. Mass.:
50990.64
Organism:
Homo sapiens (Human)
Description:
ChEMBL_1361824
Residue:
444
  
Inhibitor
Name:
BDBM445682
Synonyms:
Ex. 18/KM-06-99/(I-18) US11028104, Example 18
Type:
Small organic molecule
Emp. Form.:
C26H28N8O2
Mol. Mass.:
484.5529
SMILES:
CCn1c2nc(Cc3cn4CCCCc4n3)n(Cc3ccc(cc3)-c3ccn(C)n3)c2c(=O)[nH]c1=O
: