Target
Tryptophan 5-hydroxylase 2
Ligand
BDBM445683
Substrate
Meas. Tech.
In Vitro Enzyme Activity Assay
IC50
38.0±1 nM
Citation
 Bader, MSpecker, EMatthes, SSchütz, AMallow, KGrohmann, MNazaré, M Xanthine derivatives, their use as a medicament, and pharmaceutical preparations comprising the same US Patent  US11028104 Publication Date 6/8/2021 
Target
Name:
Tryptophan 5-hydroxylase 2
Synonyms:
NTPH TPH2_HUMAN
Type:
PROTEIN
Mol. Mass.:
56055.12
Organism:
Homo sapiens (Human)
Description:
ChEMBL_487490
Residue:
490
  
Inhibitor
Name:
BDBM445683
Synonyms:
Ex. 19/KM-06-106/(I-19) US11028104, Example 19
Type:
Small organic molecule
Emp. Form.:
C25H24N6O4
Mol. Mass.:
472.4959
SMILES:
CCn1c2nc(Cc3cn4ccccc4n3)n(Cc3ccc(CC(=O)OC)cc3)c2c(=O)[nH]c1=O
: