Target
Tryptophan 5-hydroxylase 2
Ligand
BDBM445687
Substrate
Meas. Tech.
In Vitro Enzyme Activity Assay
IC50
71.0±21 nM
Citation
 Bader, MSpecker, EMatthes, SSchütz, AMallow, KGrohmann, MNazaré, M Xanthine derivatives, their use as a medicament, and pharmaceutical preparations comprising the same US Patent  US11028104 Publication Date 6/8/2021 
Target
Name:
Tryptophan 5-hydroxylase 2
Synonyms:
NTPH TPH2_HUMAN
Type:
PROTEIN
Mol. Mass.:
56055.12
Organism:
Homo sapiens (Human)
Description:
ChEMBL_487490
Residue:
490
  
Inhibitor
Name:
BDBM445687
Synonyms:
Ex. 23/KM-06-111/(I-23) US11028104, Example 23
Type:
Small organic molecule
Emp. Form.:
C24H24N6O3
Mol. Mass.:
444.4858
SMILES:
CCn1c2nc(Cc3cn4ccccc4n3)n(Cc3ccc(CCO)cc3)c2c(=O)[nH]c1=O
: