Target
Tryptophan 5-hydroxylase 2
Ligand
BDBM502732
Substrate
Meas. Tech.
In Vitro Enzyme Activity Assay
IC50
2230±500 nM
Citation
 Bader, MSpecker, EMatthes, SSchütz, AMallow, KGrohmann, MNazaré, M Xanthine derivatives, their use as a medicament, and pharmaceutical preparations comprising the same US Patent  US11028104 Publication Date 6/8/2021 
Target
Name:
Tryptophan 5-hydroxylase 2
Synonyms:
NTPH TPH2_HUMAN
Type:
PROTEIN
Mol. Mass.:
56055.12
Organism:
Homo sapiens (Human)
Description:
ChEMBL_487490
Residue:
490
  
Inhibitor
Name:
BDBM502732
Synonyms:
US11028104, Example LP533401
Type:
Small organic molecule
Emp. Form.:
C27H22F4N4O3
Mol. Mass.:
526.4822
SMILES:
NC(Cc1ccc(cc1)-c1cc(O[C@H](c2ccc(cc2)-c2cccc(F)c2)C(F)(F)F)nc(N)n1)C(O)=O
: