Target
Muscarinic acetylcholine receptor M4
Ligand
BDBM503051
Substrate
Meas. Tech.
Binding Assay
Ki
<10±n/a nM
Citation
 Harriott, NPagano, N Compounds of formulas (VII), (VIII), (IX), (XI), (XII), (XIII), and (XIV) as muscarinic receptor 4(M4) antagonists for treating neurological diseases US Patent  US11033539 Publication Date 6/15/2021 
Target
Name:
Muscarinic acetylcholine receptor M4
Synonyms:
ACM4_HUMAN Cholinergic, muscarinic M4 Muscarinic acetylcholine receptor M2 and M4
Type:
Enzyme Catalytic Domain
Mol. Mass.:
53079.31
Organism:
Homo sapiens (Human)
Description:
Cholinergic, muscarinic M4 CHRM4 HUMAN M3::P08173
Residue:
479
  
Inhibitor
Name:
BDBM503051
Synonyms:
N-{2-[1-benzyl-3-(hydroxymethyl)piperidin-4-yl]ethyl}-1-[4- (trifluoromethoxy)phenyl]piperidine-4-carboxamide | US11033539, Cpd. No. 9-62
Type:
Small organic molecule
Emp. Form.:
C28H36F3N3O3
Mol. Mass.:
519.5989
SMILES:
OCC1CN(Cc2ccccc2)CCC1CCNC(=O)C1CCN(CC1)c1ccc(OC(F)(F)F)cc1
: