Target
Muscarinic acetylcholine receptor M4
Ligand
BDBM503052
Substrate
Meas. Tech.
Binding Assay
Ki
<10±n/a nM
Citation
 Harriott, NPagano, N Compounds of formulas (VII), (VIII), (IX), (XI), (XII), (XIII), and (XIV) as muscarinic receptor 4(M4) antagonists for treating neurological diseases US Patent  US11033539 Publication Date 6/15/2021 
Target
Name:
Muscarinic acetylcholine receptor M4
Synonyms:
ACM4_HUMAN Cholinergic, muscarinic M4 Muscarinic acetylcholine receptor M2 and M4
Type:
Enzyme Catalytic Domain
Mol. Mass.:
53079.31
Organism:
Homo sapiens (Human)
Description:
Cholinergic, muscarinic M4 CHRM4 HUMAN M3::P08173
Residue:
479
  
Inhibitor
Name:
BDBM503052
Synonyms:
N-[2-(1-benzylpiperidin-4-yl)ethyl]-1-[3-chloro-5 (trifluoromethyl)pyridin-2-yl]piperidine-4-carboxamide | US11033539, Cpd. No. 9-63
Type:
Small organic molecule
Emp. Form.:
C26H32ClF3N4O
Mol. Mass.:
509.007
SMILES:
FC(F)(F)c1cnc(N2CCC(CC2)C(=O)NCCC2CCN(Cc3ccccc3)CC2)c(Cl)c1
: