Target
Muscarinic acetylcholine receptor M4
Ligand
BDBM503053
Substrate
Meas. Tech.
Binding Assay
Ki
<10±n/a nM
Citation
 Harriott, NPagano, N Compounds of formulas (VII), (VIII), (IX), (XI), (XII), (XIII), and (XIV) as muscarinic receptor 4(M4) antagonists for treating neurological diseases US Patent  US11033539 Publication Date 6/15/2021 
Target
Name:
Muscarinic acetylcholine receptor M4
Synonyms:
ACM4_HUMAN Cholinergic, muscarinic M4 Muscarinic acetylcholine receptor M2 and M4
Type:
Enzyme Catalytic Domain
Mol. Mass.:
53079.31
Organism:
Homo sapiens (Human)
Description:
Cholinergic, muscarinic M4 CHRM4 HUMAN M3::P08173
Residue:
479
  
Inhibitor
Name:
BDBM503053
Synonyms:
N-{2-[1-benzyl-4-(hydroxymethyl)piperidin-4-yl]ethyl}-1-[3- fluoro-4-(trifluoromethoxy)phenyl]piperidine-4-carboxamide | US11033539, Cpd. No. 9-64
Type:
Small organic molecule
Emp. Form.:
C28H35F4N3O3
Mol. Mass.:
537.5894
SMILES:
OCC1(CCNC(=O)C2CCN(CC2)c2ccc(OC(F)(F)F)c(F)c2)CCN(Cc2ccccc2)CC1
: