Target
Muscarinic acetylcholine receptor M4
Ligand
BDBM503199
Substrate
Meas. Tech.
Binding Assay
Ki
<10±n/a nM
Citation
 Harriott, NPagano, N Compounds of formulas (VII), (VIII), (IX), (XI), (XII), (XIII), and (XIV) as muscarinic receptor 4(M4) antagonists for treating neurological diseases US Patent  US11033539 Publication Date 6/15/2021 
Target
Name:
Muscarinic acetylcholine receptor M4
Synonyms:
ACM4_HUMAN Cholinergic, muscarinic M4 Muscarinic acetylcholine receptor M2 and M4
Type:
Enzyme Catalytic Domain
Mol. Mass.:
53079.31
Organism:
Homo sapiens (Human)
Description:
Cholinergic, muscarinic M4 CHRM4 HUMAN M3::P08173
Residue:
479
  
Inhibitor
Name:
BDBM503199
Synonyms:
N-[2-(1-benzylpiperidin-4-yl)ethyl]-2-(4-fluorophenyl)-7- methylpyrazolo[1,5-a]pyrimidine-6-carboxamide | US11033539, Cpd. No. 18-4
Type:
Small organic molecule
Emp. Form.:
C28H30FN5O
Mol. Mass.:
471.5691
SMILES:
Cc1c(cnc2cc(nn12)-c1ccc(F)cc1)C(=O)NCCC1CCN(Cc2ccccc2)CC1
: