Target
Muscarinic acetylcholine receptor M4
Ligand
BDBM503233
Substrate
Meas. Tech.
Binding Assay
Ki
<10±n/a nM
Citation
 Harriott, NPagano, N Compounds of formulas (VII), (VIII), (IX), (XI), (XII), (XIII), and (XIV) as muscarinic receptor 4(M4) antagonists for treating neurological diseases US Patent  US11033539 Publication Date 6/15/2021 
Target
Name:
Muscarinic acetylcholine receptor M4
Synonyms:
ACM4_HUMAN Cholinergic, muscarinic M4 Muscarinic acetylcholine receptor M2 and M4
Type:
Enzyme Catalytic Domain
Mol. Mass.:
53079.31
Organism:
Homo sapiens (Human)
Description:
Cholinergic, muscarinic M4 CHRM4 HUMAN M3::P08173
Residue:
479
  
Inhibitor
Name:
BDBM503233
Synonyms:
(2R,6S)-4-(5-cyanopyrimidin-2-yl)-2,6-dimethyl-N-(2-{1-[2- (trimethylsilyl)ethyl]piperidin-4-yl}ethyl)piperazine-1- carboxamide | US11033539, Cpd. No. 21-7
Type:
Small organic molecule
Emp. Form.:
C24H41N7OSi
Mol. Mass.:
471.7141
SMILES:
C[C@H]1CN(C[C@@H](C)N1C(=O)NCCC1CCN(CC[Si](C)(C)C)CC1)c1ncc(cn1)C#N
: