Target
Muscarinic acetylcholine receptor M4
Ligand
BDBM503250
Substrate
Meas. Tech.
Binding Assay
Ki
<10±n/a nM
Citation
 Harriott, NPagano, N Compounds of formulas (VII), (VIII), (IX), (XI), (XII), (XIII), and (XIV) as muscarinic receptor 4(M4) antagonists for treating neurological diseases US Patent  US11033539 Publication Date 6/15/2021 
Target
Name:
Muscarinic acetylcholine receptor M4
Synonyms:
ACM4_HUMAN Cholinergic, muscarinic M4 Muscarinic acetylcholine receptor M2 and M4
Type:
Enzyme Catalytic Domain
Mol. Mass.:
53079.31
Organism:
Homo sapiens (Human)
Description:
Cholinergic, muscarinic M4 CHRM4 HUMAN M3::P08173
Residue:
479
  
Inhibitor
Name:
BDBM503250
Synonyms:
(2R,6S)-N-[2-(1-benzylpiperidin-4-yl)ethyl]-4-(3-chloro-4,5- difluorophenyl)-2,6-dimethylpiperazine-1-carboxamide | US11033539, Cpd. No. 22-7
Type:
Small organic molecule
Emp. Form.:
C27H35ClF2N4O
Mol. Mass.:
505.043
SMILES:
C[C@H]1CN(C[C@@H](C)N1C(=O)NCCC1CCN(Cc2ccccc2)CC1)c1cc(F)c(F)c(Cl)c1
: