Target
Muscarinic acetylcholine receptor M4
Ligand
BDBM503266
Substrate
Meas. Tech.
Binding Assay
Ki
<10±n/a nM
Citation
 Harriott, NPagano, N Compounds of formulas (VII), (VIII), (IX), (XI), (XII), (XIII), and (XIV) as muscarinic receptor 4(M4) antagonists for treating neurological diseases US Patent  US11033539 Publication Date 6/15/2021 
Target
Name:
Muscarinic acetylcholine receptor M4
Synonyms:
ACM4_HUMAN Cholinergic, muscarinic M4 Muscarinic acetylcholine receptor M2 and M4
Type:
Enzyme Catalytic Domain
Mol. Mass.:
53079.31
Organism:
Homo sapiens (Human)
Description:
Cholinergic, muscarinic M4 CHRM4 HUMAN M3::P08173
Residue:
479
  
Inhibitor
Name:
BDBM503266
Synonyms:
N-[2-(1-benzylpiperidin-4-yl)ethyl]-4-[5- (trifluoromethyl)pyrazin-2-yl]piperazine-1-carboxamide | US11033539, Cpd. No. 22-25
Type:
Small organic molecule
Emp. Form.:
C24H31F3N6O
Mol. Mass.:
476.5377
SMILES:
FC(F)(F)c1cnc(cn1)N1CCN(CC1)C(=O)NCCC1CCN(Cc2ccccc2)CC1
: