Target
Poly [ADP-ribose] polymerase 1
Ligand
BDBM503599
Substrate
Meas. Tech.
Scintillation Proximity Assay
IC50
14.0±n/a nM
Citation
 Takahashi, TKluge, ALagu, BJi, N Poly-ADP ribose polymerase (PARP) inhibitors US Patent  US11034670 Publication Date 6/15/2021 
Target
Name:
Poly [ADP-ribose] polymerase 1
Synonyms:
(ARTD1 or PARP1) 2.4.2.30 ADPRT ARTD1 Human diphtheria toxin-like ADP-ribosyltransferase (ARTD1 or PARP1) NT-PARP-1 PARP1 PPOL Poly [ADP-ribose] polymerase 1 (PARP) Poly [ADP-ribose] polymerase 1 (PARP1) Poly [ADP-ribose] polymerase 1, 28-kDa form Poly [ADP-ribose] polymerase 1, processed C-terminus Poly [ADP-ribose] polymerase-1 Poly(ADP-ribose) polymerase-1 (ARTD1/PARP1) Protein poly-ADP-ribosyltransferase PARP1 | Synonyms=ADPRT
Type:
Mol. Mass.:
113114.22
Organism:
Homo sapiens (Human)
Description:
P09874
Residue:
1014
  
Inhibitor
Name:
BDBM503599
Synonyms:
US11034670, Ex. 39
Type:
Small organic molecule
Emp. Form.:
C20H19N7O2
Mol. Mass.:
389.4106
SMILES:
O=C(CCc1nc2ccccc2c(=O)[nH]1)N1CCN(CC1)c1cnc(cn1)C#N
: