Target
Poly [ADP-ribose] polymerase 2
Ligand
BDBM503599
Substrate
Meas. Tech.
Scintillation Proximity Assay
IC50
468±n/a nM
Citation
 Takahashi, TKluge, ALagu, BJi, N Poly-ADP ribose polymerase (PARP) inhibitors US Patent  US11034670 Publication Date 6/15/2021 
Target
Name:
Poly [ADP-ribose] polymerase 2
Synonyms:
(ARTD2 or PARP2) ADPRTL2 PARP2_HUMAN Poly [ADP-ribose] polymerase 2 (PARP2)
Type:
Enzyme
Mol. Mass.:
66225.70
Organism:
Homo sapiens (Human)
Description:
Q9UGN5
Residue:
583
  
Inhibitor
Name:
BDBM503599
Synonyms:
US11034670, Ex. 39
Type:
Small organic molecule
Emp. Form.:
C20H19N7O2
Mol. Mass.:
389.4106
SMILES:
O=C(CCc1nc2ccccc2c(=O)[nH]1)N1CCN(CC1)c1cnc(cn1)C#N
: