Target
Mitogen-activated protein kinase kinase kinase kinase 1
Ligand
BDBM503945
Substrate
Meas. Tech.
Binding Assay
Ki
0.135±n/a nM
Citation
 Chan, BDaniels, BDrobnick, JGazzard, LHeffron, THuestis, MLiang, JMalhotra, SMendonca, RRajapaksa, NSiu, MStivala, CTellis, JWang, WWei, BZhou, ACartwright, MWGancia, EJones, GLainchbury, MMadin, ASeward, EFavor, DFong, KCGood, AHu, YHu, BLu, A Naphthyridines as inhibitors of HPK1 US Patent  US11034692 Publication Date 6/15/2021 
Target
Name:
Mitogen-activated protein kinase kinase kinase kinase 1
Synonyms:
HPK1 MAP4K1
Type:
PROTEIN
Mol. Mass.:
91316.07
Organism:
Homo sapiens (Human)
Description:
ChEMBL_586597
Residue:
833
  
Inhibitor
Name:
BDBM503945
Synonyms:
US11034692, Compound 223 | cis-N-(8-amino-6-(3,4-dihydro-2H- pyrido[4,3-b][1,4]oxazin-8-yl)-2,7- naphthyridin-3-yl)-2- fluorocyclopropanecarboxamide
Type:
Small organic molecule
Emp. Form.:
C19H17FN6O2
Mol. Mass.:
380.3757
SMILES:
Nc1nc(cc2cc(NC(=O)[C@@H]3C[C@@H]3F)ncc12)-c1cncc2NCCOc12
: