Target
Mitogen-activated protein kinase kinase kinase kinase 1
Ligand
BDBM504006
Substrate
Meas. Tech.
Binding Assay
Ki
0.116±n/a nM
Citation
 Chan, BDaniels, BDrobnick, JGazzard, LHeffron, THuestis, MLiang, JMalhotra, SMendonca, RRajapaksa, NSiu, MStivala, CTellis, JWang, WWei, BZhou, ACartwright, MWGancia, EJones, GLainchbury, MMadin, ASeward, EFavor, DFong, KCGood, AHu, YHu, BLu, A Naphthyridines as inhibitors of HPK1 US Patent  US11034692 Publication Date 6/15/2021 
Target
Name:
Mitogen-activated protein kinase kinase kinase kinase 1
Synonyms:
HPK1 MAP4K1
Type:
PROTEIN
Mol. Mass.:
91316.07
Organism:
Homo sapiens (Human)
Description:
ChEMBL_586597
Residue:
833
  
Inhibitor
Name:
BDBM504006
Synonyms:
(1R,2S)—N-[8-amino-5-chloro-6-(4-methylpyridin-3-yl)-2,7-naphthyridin-3-yl]-2-(cyanomethyl)cyclopropane-1-carboxamide (Compound 269) and (1S,2R)—N-[8-amino-5-chloro-6-(4-methylpyridin-3-yl)-2,7-naphthyridin-3-yl]-2-(cyanomethyl)cyclopropane-1-carboxamide | US11034692, Compound 270
Type:
Small organic molecule
Emp. Form.:
C20H17ClN6O
Mol. Mass.:
392.842
SMILES:
Cc1ccncc1-c1nc(N)c2cnc(NC(=O)[C@H]3C[C@@H]3CC#N)cc2c1Cl
: