Target
Mitogen-activated protein kinase kinase kinase kinase 1
Ligand
BDBM504060
Substrate
Meas. Tech.
Binding Assay
Ki
0.114±n/a nM
Citation
 Chan, BDaniels, BDrobnick, JGazzard, LHeffron, THuestis, MLiang, JMalhotra, SMendonca, RRajapaksa, NSiu, MStivala, CTellis, JWang, WWei, BZhou, ACartwright, MWGancia, EJones, GLainchbury, MMadin, ASeward, EFavor, DFong, KCGood, AHu, YHu, BLu, A Naphthyridines as inhibitors of HPK1 US Patent  US11034692 Publication Date 6/15/2021 
Target
Name:
Mitogen-activated protein kinase kinase kinase kinase 1
Synonyms:
HPK1 MAP4K1
Type:
PROTEIN
Mol. Mass.:
91316.07
Organism:
Homo sapiens (Human)
Description:
ChEMBL_586597
Residue:
833
  
Inhibitor
Name:
BDBM504060
Synonyms:
US11034692, Compound 328
Type:
Small organic molecule
Emp. Form.:
C23H23N7O
Mol. Mass.:
413.475
SMILES:
C[C@@H]1[C@@H]([C@H]1c1cnn(C)c1)C(=O)Nc1cc2cc(nc(N)c2cn1)-c1cnccc1C
: