Target
Metabotropic glutamate receptor 4
Ligand
BDBM504211
Substrate
Meas. Tech.
Biological Assay
EC50
58.0±n/a nM
Citation
 Biemans, BGuba, WJaeschke, GLindemann, LO''Hara, FRicci, ARueher, DVieira, E Ethynyl derivatives US Patent  US11034699 Publication Date 6/15/2021 
Target
Name:
Metabotropic glutamate receptor 4
Synonyms:
GPRC1D GRM4_HUMAN MGLUR4 Metabotropic glutamate receptor 4 (mGlu4) metabotropic glutamate 4
Type:
Protein
Mol. Mass.:
101899.95
Organism:
Homo sapiens (Human)
Description:
Q14833
Residue:
912
  
Inhibitor
Name:
BDBM504211
Synonyms:
(8S)-3′-[2,6-Difluoro-4-(2-phenylethynyl)phenyl]-1′-methyl-spiro[6,7-dihydro-5H-isoquinoline-8,6′-hexahydropyrimidine]-2′,4′-dione | US11034699, Example 1
Type:
Small organic molecule
Emp. Form.:
C27H21F2N3O2
Mol. Mass.:
457.4713
SMILES:
CN1C(=O)N(C(=O)C[C@]11CCCc2ccncc12)c1c(F)cc(cc1F)C#Cc1ccccc1
: