Target
Metabotropic glutamate receptor 4
Ligand
BDBM504286
Substrate
Meas. Tech.
Biological Assay
EC50
51.0±n/a nM
Citation
 Biemans, BGuba, WJaeschke, GLindemann, LO''Hara, FRicci, ARueher, DVieira, E Ethynyl derivatives US Patent  US11034699 Publication Date 6/15/2021 
Target
Name:
Metabotropic glutamate receptor 4
Synonyms:
GPRC1D GRM4_HUMAN MGLUR4 Metabotropic glutamate receptor 4 (mGlu4) metabotropic glutamate 4
Type:
Protein
Mol. Mass.:
101899.95
Organism:
Homo sapiens (Human)
Description:
Q14833
Residue:
912
  
Inhibitor
Name:
BDBM504286
Synonyms:
(4S)-3′-[2,6-Difluoro-4-(2-phenylethynyl)phenyl]-1′-methyl-spiro[1,5,6,7-tetrahydroindazole-4,6′-hexahydropyrimidine]-2′,4′-dione | US11034699, Example 12
Type:
Small organic molecule
Emp. Form.:
C25H20F2N4O2
Mol. Mass.:
446.4487
SMILES:
CN1C(=O)N(C(=O)C[C@]11CCCc2[nH]ncc12)c1c(F)cc(cc1F)C#Cc1ccccc1
: