Target
5'-nucleotidase
Ligand
BDBM419934
Substrate
Meas. Tech.
Enzyme In Vitro Assay
IC50
109±n/a nM
Citation
 Billedeau, RJLi, JChen, L Ectonucleotidase inhibitors and methods of use thereof US Patent  US11034715 Publication Date 6/15/2021 
Target
Name:
5'-nucleotidase
Synonyms:
5'-NT 5NTD_HUMAN Ecto-5'-nucleotidase NT5 NTE
Type:
Enzyme
Mol. Mass.:
63371.54
Organism:
Homo sapiens (Human)
Description:
P21589
Residue:
574
  
Inhibitor
Name:
BDBM419934
Synonyms:
US10472364, Compound 20 US11034715, Cpd. # 20 | US11208414, Cpd. # 20
Type:
Small organic molecule
Emp. Form.:
C21H18ClF4N5O7
Mol. Mass.:
563.844
SMILES:
Nc1nc(Cl)nc2n(cnc12)[C@@H]1O[C@H](COC(Cc2ccc(cc2)C(F)(F)F)(C(O)=O)C(O)=O)[C@@H](O)[C@@H]1F
: