Target
5'-nucleotidase
Ligand
BDBM435850
Substrate
Meas. Tech.
Enzyme In Vitro Assay
IC50
56.0±n/a nM
Citation
 Billedeau, RJLi, JChen, L Ectonucleotidase inhibitors and methods of use thereof US Patent  US11034715 Publication Date 6/15/2021 
Target
Name:
5'-nucleotidase
Synonyms:
5'-NT 5NTD_HUMAN Ecto-5'-nucleotidase NT5 NTE
Type:
Enzyme
Mol. Mass.:
63371.54
Organism:
Homo sapiens (Human)
Description:
P21589
Residue:
574
  
Inhibitor
Name:
BDBM435850
Synonyms:
US10570167, Cpd. # 176 | US11034715, Cpd. # 176
Type:
Small organic molecule
Emp. Form.:
C25H22ClFN6O7
Mol. Mass.:
572.93
SMILES:
Nc1nc(Cl)nc2n(cnc12)[C@@H]1O[C@H](COC(Cc2ccc(cc2)-c2ccccn2)(C(O)=O)C(O)=O)[C@@H](O)[C@@H]1F
: