Target
Somatostatin receptor type 1
Ligand
BDBM506502
Substrate
Meas. Tech.
SSTR1 I-125 Somatostatin Competition Binding Assay for Selectivity Versus SSTR4
IC50
2512±n/a nM
Citation
 Cheruvallath, ZGreen, JJohnson, BSchleicher, KSun, HTang, M Piperidinyl-3-(aryloxy)propanamides and propanoates US Patent  US11045457 Publication Date 6/29/2021 
Target
Name:
Somatostatin receptor type 1
Synonyms:
SOMATOSTATIN SST1 SS-1-R SS1R SSTR1 | Somatostatin receptor type 1 (SSTR1)
Type:
Enzyme
Mol. Mass.:
42692.81
Organism:
Homo sapiens (Human)
Description:
P30872
Residue:
391
  
Inhibitor
Name:
BDBM506502
Synonyms:
US11045457, Example 102
Type:
Small organic molecule
Emp. Form.:
C18H25F3N2O3
Mol. Mass.:
374.3979
SMILES:
CN1CCC(CC1)NC(=O)C(C)(C)COc1ccccc1OC(F)(F)F
: