Target
Somatostatin receptor type 4
Ligand
BDBM506587
Substrate
Meas. Tech.
Inhibition of Forskolin Stimulated cAMP in Cells Overexpressing SSTR4
EC50
6.31±n/a nM
Citation
 Cheruvallath, ZGreen, JJohnson, BSchleicher, KSun, HTang, M Piperidinyl-3-(aryloxy)propanamides and propanoates US Patent  US11045457 Publication Date 6/29/2021 
Target
Name:
Somatostatin receptor type 4
Synonyms:
SOMATOSTATIN SST4 SS4-R SSR4_HUMAN SSTR4 | Somatostatin receptor type 4 (SSTR4)
Type:
Enzyme
Mol. Mass.:
42015.38
Organism:
Homo sapiens (Human)
Description:
P31391
Residue:
388
  
Inhibitor
Name:
BDBM506587
Synonyms:
US11045457, Example 188
Type:
Small organic molecule
Emp. Form.:
C17H24ClFN2O2
Mol. Mass.:
342.836
SMILES:
CN1CC[C@H](NC(=O)C(C)(C)COc2ccccc2Cl)[C@@H](F)C1
: