BDBM100207 (5E)-3-(3-chlorophenyl)-5-[(2,5-dimethyl-1-pyridin-3-yl-pyrrol-3-yl)methylidene]-2-sulfanylidene-1,3-thiazolidin-4-one::(5E)-3-(3-chlorophenyl)-5-[(2,5-dimethyl-1-pyridin-3-ylpyrrol-3-yl)methylidene]-2-sulfanylidene-1,3-thiazolidin-4-one::(5E)-3-(3-chlorophenyl)-5-[[2,5-dimethyl-1-(3-pyridinyl)-3-pyrrolyl]methylidene]-2-sulfanylidene-4-thiazolidinone::(5E)-3-(3-chlorophenyl)-5-[[2,5-dimethyl-1-(3-pyridyl)pyrrol-3-yl]methylene]-2-thioxo-thiazolidin-4-one::3-(3-chlorophenyl)-5-{[2,5-dimethyl-1-(3-pyridinyl)-1H-pyrrol-3-yl]methylene}-2-thioxo-1,3-thiazolidin-4-one::MLS000575323::SMR000196557::US20230364057, Compound 171::cid_2291702
SMILES Cc1cc(\C=C2\SC(=S)N(C2=O)c2cccc(Cl)c2)c(C)n1-c1cccnc1
InChI Key InChIKey=BTSGSYXWDABRCF-VXLYETTFSA-N
Data  3 IC50
  Tab Delimited (TSV)   2D SDfile   Computed 3D by Vconf -m prep SDfile
Find this compound or compounds like it in BindingDB:
Activity Spreadsheet -- Enzyme Inhibition Constant Data from BindingDB
Found 3 hits for monomerid = 100207
TargetCOUP transcription factor 2(Homo sapiens (Human))
The Scripps Research Institute Molecular Screening Center
Curated by PubChem BioAssay
LigandPNGBDBM100207((5E)-3-(3-chlorophenyl)-5-[(2,5-dimethyl-1-pyridin...)
Affinity DataIC50:  5.65E+3nM
In DepthDetails PCBioAssay
TargetDNA gyrase inhibitor()
The Florida International University Board Of Trustees
US Patent
LigandPNGBDBM100207((5E)-3-(3-chlorophenyl)-5-[(2,5-dimethyl-1-pyridin...)
Affinity DataIC50:  2.00E+4nM. Assay description: SDFQ HTS primary assay using pAB1_FL905 was performed in 2 µL of (1 xDNA gyrase buffer: 20 mM Tris-Acetate pH 7.9, 50 mM KAc, 10 mM MgCl2, 2 mM DTT, ...
In DepthDetails US Patent
TargetTegument protein VP16(Human herpesvirus 1 (strain 17) (HHV-1) (Human her...)
The Scripps Research Institute Molecular Screening Center
Curated by PubChem BioAssay
LigandPNGBDBM100207((5E)-3-(3-chlorophenyl)-5-[(2,5-dimethyl-1-pyridin...)
Affinity DataIC50:  8.54E+4nM. Assay description: Source (MLPCN Center Name): The Scripps Research Institute Molecular Screening Center Affiliation: The Scripps Research Institute, TSRI Assay Provide...
In DepthDetails PCBioAssay