BDBM10147 lysine sulfonamide analogue 11::methyl N-[(1S)-1-{[(5R)-5-[(4-aminobenzene)(2-methylpropyl)sulfonamido]-6-hydroxyhexyl]carbamoyl}-2-(naphthalen-2-yl)ethyl]carbamate
SMILES COC(=O)N[C@@H](Cc1ccc2ccccc2c1)C(=O)NCCCCC(CO)N(CC(C)C)S(=O)(=O)c1ccc(N)cc1
InChI Key InChIKey=DRDQKOKQQIVXRZ-ACEFPKFPSA-N
Data  1 IC50
  Tab Delimited (TSV)   2D SDfile   Computed 3D by Vconf -m prep SDfile
Find this compound or compounds like it in BindingDB:
Activity Spreadsheet -- Enzyme Inhibition Constant Data from BindingDB
Found 1 hit for monomerid = 10147
TargetDimer of Gag-Pol polyprotein [501-599](Human immunodeficiency virus type 1)
Ambrilia Biopharma
LigandPNGBDBM10147(lysine sulfonamide analogue 11 | methyl N-[(1S)-1-...)
Affinity DataIC50:  1.20nMpH: 4.7 T: 2°C. Assay description: HIV-1 protease activity was measured by a continuous fluorometric assay. The proteolytic activity can be monitored by the increase in fluorescence in...
In DepthDetails ArticlePubMed