BDBM104016 PS77
SMILES OC(=O)CSC(CC(=O)c1ccc(Cl)cc1)c1ccccc1Sc1ccc(Cl)cc1
InChI Key InChIKey=VAULNRMHUJFUGY-UHFFFAOYSA-N
Data  2 IC50  1 EC50
  Tab Delimited (TSV)   2D SDfile   Computed 3D by Vconf -m prep SDfile
Find this compound or compounds like it in BindingDB:
Activity Spreadsheet -- Enzyme Inhibition Constant Data from BindingDB
Found 3 hits for monomerid = 104016
TargetSerine/threonine-protein kinase PKH2 [1-944](Candida albicans SC5314)
Universit£Tsklinikum Frankfurt
LigandPNGBDBM104016(PS77)
Affinity DataEC50:  4.40E+4nMpH: 7.4Assay Description:The AlphaScreen Assay (Perkin Elmer) was performed according to the manufacturer's protocol in 384-well microtiter plates. Incubations were performe...
In DepthDetails ArticlePubMed
Target3-phosphoinositide-dependent protein kinase 1(Homo sapiens (Human))
Universit£Tsklinikum Frankfurt
LigandPNGBDBM104016(PS77)
Affinity DataIC50:  3.80E+4nMpH: 7.4 T: 2°C. Assay description: A 20ul mix containing 50mM Tris pH 7.5, 0.05mg/ml BSA, 0.1% β-mercaptoethanol, 10mM MgCl2, 100μM [γ-P32]ATP (5-50cpm/pmol), 0.003% Bri...
In DepthDetails ArticlePubMed
TargetSerine/threonine-protein kinase PKH2 [1-944](Candida albicans SC5314)
Universit£Tsklinikum Frankfurt
LigandPNGBDBM104016(PS77)
Affinity DataIC50:  1.70E+4nMpH: 7.4 T: 2°C. Assay description: A 20ul mix containing 50mM Tris pH 7.5, 0.05mg/ml BSA, 0.1% β-mercaptoethanol, 10mM MgCl2, 100μM [γ-P32]ATP (5-50cpm/pmol), 0.003% Bri...
In DepthDetails ArticlePubMed