BDBM142234 US8933098, 1::US8933099, 1
SMILES Cc1ccc(nc1C(=O)Nc1c(C)cc(cc1C)C(O)=O)N1CCC(O)CC1
InChI Key InChIKey=WOJKYHBOHSQZDW-UHFFFAOYSA-N
Data  8 KI  11 IC50
  Tab Delimited (TSV)   2D SDfile   Computed 3D by Vconf -m prep SDfile
Find this compound or compounds like it in BindingDB:
Activity Spreadsheet -- Enzyme Inhibition Constant Data from BindingDB
Found 19 hits for monomerid = 142234
TargetProstaglandin E2 receptor EP4 subtype(Homo sapiens (Human))
Eli Lilly
Curated by ChEMBL
LigandPNGBDBM142234(US8933098, 1 | US8933099, 1)
Affinity DataKi:  58nM. Assay description: Binding affinity to human EP4
Ligand InfoPC cidPC sid
In DepthDetails ArticlePubMed
TargetProstaglandin E2 receptor EP4 subtype(Homo sapiens (Human))
Eli Lilly
Curated by ChEMBL
LigandPNGBDBM142234(US8933098, 1 | US8933099, 1)
Affinity DataKi:  76nMpH: 7.4Assay Description:hEP1 and hEP4 membranes are prepared from recombinant HEK293 cells stably expressing human EP1 (Genbank accession number AY275470) or EP4 (Genbank ac...
Ligand InfoPC cidPC sid
In DepthDetails US Patent
TargetProstaglandin E2 receptor EP3 subtype(Homo sapiens (Human))
Eli Lilly
US Patent
LigandPNGBDBM142234(US8933098, 1 | US8933099, 1)
Affinity DataKi: >1.40E+4nMpH: 7.4Assay Description:hEP1 and hEP4 membranes are prepared from recombinant HEK293 cells stably expressing human EP1 (Genbank accession number AY275470) or EP4 (Genbank ac...
Ligand InfoPC cidPC sid
In DepthDetails US Patent
TargetProstaglandin E2 receptor EP3 subtype(Homo sapiens (Human))
Eli Lilly
US Patent
LigandPNGBDBM142234(US8933098, 1 | US8933099, 1)
Affinity DataKi: >1.40E+4nM. Assay description: Binding affinity to human EP3
Ligand InfoPC cidPC sid
In DepthDetails ArticlePubMed
TargetProstaglandin E2 receptor EP1 subtype(Homo sapiens (Human))
Eli Lilly
US Patent
LigandPNGBDBM142234(US8933098, 1 | US8933099, 1)
Affinity DataKi: >1.75E+4nMpH: 7.4Assay Description:hEP1 and hEP4 membranes are prepared from recombinant HEK293 cells stably expressing human EP1 (Genbank accession number AY275470) or EP4 (Genbank ac...
Ligand InfoPC cidPC sid
In DepthDetails US Patent
TargetProstaglandin E2 receptor EP1 subtype(Homo sapiens (Human))
Eli Lilly
US Patent
LigandPNGBDBM142234(US8933098, 1 | US8933099, 1)
Affinity DataKi: >1.75E+4nM. Assay description: Binding affinity to human EP1
Ligand InfoPC cidPC sid
In DepthDetails ArticlePubMed
TargetProstaglandin E2 receptor EP2 subtype(Homo sapiens (Human))
Eli Lilly
US Patent
LigandPNGBDBM142234(US8933098, 1 | US8933099, 1)
Affinity DataKi: >1.89E+4nMpH: 7.4Assay Description:hEP1 and hEP4 membranes are prepared from recombinant HEK293 cells stably expressing human EP1 (Genbank accession number AY275470) or EP4 (Genbank ac...
Ligand InfoPC cidPC sid
In DepthDetails US Patent
TargetProstaglandin E2 receptor EP2 subtype(Homo sapiens (Human))
Eli Lilly
US Patent
LigandPNGBDBM142234(US8933098, 1 | US8933099, 1)
Affinity DataKi: >1.89E+4nM. Assay description: Binding affinity to human EP2
Ligand InfoPC cidPC sid
In DepthDetails ArticlePubMed
TargetCytochrome P450 2C8(Homo sapiens (Human))
Eli Lilly
Curated by ChEMBL
LigandPNGBDBM142234(US8933098, 1 | US8933099, 1)
Affinity DataIC50: >1.00E+4nM. Assay description: Inhibition of CYP2C8 (unknown origin)
Ligand InfoPC cidPC sid
In DepthDetails ArticlePubMed
TargetCytochrome P450 2C9(Homo sapiens (Human))
Eli Lilly
Curated by ChEMBL
LigandPNGBDBM142234(US8933098, 1 | US8933099, 1)
Affinity DataIC50: >1.00E+4nM. Assay description: Inhibition of CYP2C9 (unknown origin)
Ligand InfoPC cidPC sid
In DepthDetails ArticlePubMed
TargetCytochrome P450 2B6(Homo sapiens (Human))
Eli Lilly
Curated by ChEMBL
LigandPNGBDBM142234(US8933098, 1 | US8933099, 1)
Affinity DataIC50: >1.00E+4nM. Assay description: Inhibition of CYP2B6 (unknown origin)
Ligand InfoPC cidPC sid
In DepthDetails ArticlePubMed
TargetCytochrome P450 1A2(Homo sapiens (Human))
Eli Lilly
Curated by ChEMBL
LigandPNGBDBM142234(US8933098, 1 | US8933099, 1)
Affinity DataIC50: >1.00E+4nM. Assay description: Inhibition of CYP1A2 (unknown origin)
Ligand InfoPC cidPC sid
In DepthDetails ArticlePubMed
TargetCytochrome P450 2C19(Homo sapiens (Human))
Eli Lilly
Curated by ChEMBL
LigandPNGBDBM142234(US8933098, 1 | US8933099, 1)
Affinity DataIC50: >1.00E+4nM. Assay description: Inhibition of CYP2C19 (unknown origin)
Ligand InfoPC cidPC sid
In DepthDetails ArticlePubMed
TargetCytochrome P450 3A4(Homo sapiens (Human))
Eli Lilly
Curated by ChEMBL
LigandPNGBDBM142234(US8933098, 1 | US8933099, 1)
Affinity DataIC50: >1.00E+4nM. Assay description: Inhibition of CYP3A4 (unknown origin)
Ligand InfoPC cidPC sid
In DepthDetails ArticlePubMed
TargetProstaglandin E2 receptor EP4 subtype(Homo sapiens (Human))
Eli Lilly
Curated by ChEMBL
LigandPNGBDBM142234(US8933098, 1 | US8933099, 1)
Affinity DataIC50:  5.60nM. Assay description: Antagonist activity against human EP4 expressed in HEK293 cells assessed as inhibition of PGE2-stimulated production of cAMP incubated for 20 mins by...
Ligand InfoPC cidPC sid
In DepthDetails ArticlePubMed
TargetProstaglandin E2 receptor EP4 subtype(Homo sapiens (Human))
Eli Lilly
Curated by ChEMBL
LigandPNGBDBM142234(US8933098, 1 | US8933099, 1)
Affinity DataIC50:  123nM. Assay description: Antagonist activity against EP4 in human whole blood assessed as reversal of PGE2-mediated suppression of LPS-induced TNF-alpha production preincubat...
Ligand InfoPC cidPC sid
In DepthDetails ArticlePubMed
TargetFibroblast growth factor receptor 1(Homo sapiens (Human))
Eisai R&D Management
US Patent
LigandPNGBDBM142234(US8933098, 1 | US8933099, 1)
Affinity DataIC50:  9.80nMT: 2°C. Assay description: In this assay, the inhibitory activity of a test substance against the tyrosine kinase activity of FGFR1 protein is measured.To each well of a flat b...
Ligand InfoPC cidPC sid
In DepthDetails US Patent
TargetCytochrome P450 2D6(Homo sapiens (Human))
Eli Lilly
Curated by ChEMBL
LigandPNGBDBM142234(US8933098, 1 | US8933099, 1)
Affinity DataIC50: >1.00E+4nM. Assay description: Inhibition of CYP2D6 (unknown origin)
Ligand InfoPC cidPC sid
In DepthDetails ArticlePubMed
TargetProstaglandin E2 receptor EP4 subtype(Rattus norvegicus)
Eli Lilly
Curated by ChEMBL
LigandPNGBDBM142234(US8933098, 1 | US8933099, 1)
Affinity DataIC50:  12nM. Assay description: Antagonist activity against rat EP4 assessed as inhibition of PGE2-stimulated production of cAMP
Ligand InfoPC cidPC sid
In DepthDetails ArticlePubMed