BDBM191024 US10077266, Example 136::US9181249, 136::US9708313, 136
SMILES CC(C)Nc1nc2CN(CCc2nc1N1CCN(Cc2ccc(F)cc2F)CC1)S(C)(=O)=O
InChI Key InChIKey=LLDFGRFJUUBZCG-UHFFFAOYSA-N
Data  3 IC50
  Tab Delimited (TSV)   2D SDfile   Computed 3D by Vconf -m prep SDfile
Find this compound or compounds like it in BindingDB:
Activity Spreadsheet -- Enzyme Inhibition Constant Data from BindingDB
Found 3 hits for monomerid = 191024
TargetG-protein coupled receptor 6(Homo sapiens (Human))
Takeda Pharmaceutical
US Patent
LigandPNGBDBM191024(US10077266, Example 136 | US9181249, 136 | US97083...)
Affinity DataIC50:  0.0279nM. Assay description: This cell based assay measures the ability of compounds to inhibit the constitutive cAMP activity of GPR6 receptor expressed in CHO-K1 cells. CHO cel...
Ligand InfoPC cidPC sid
In DepthDetails US Patent
TargetG-protein coupled receptor 6(Homo sapiens (Human))
Takeda Pharmaceutical
US Patent
LigandPNGBDBM191024(US10077266, Example 136 | US9181249, 136 | US97083...)
Affinity DataIC50:  2.79E+4nM. Assay description: This cell based assay measures the ability of compounds to inhibit the constitutive cAMP activity of GPR6 receptor expressed in CHO-K1 cells. CHO cel...
Ligand InfoPC cidPC sid
In DepthDetails US Patent
TargetG-protein coupled receptor 6(Homo sapiens (Human))
Takeda Pharmaceutical
US Patent
LigandPNGBDBM191024(US10077266, Example 136 | US9181249, 136 | US97083...)
Affinity DataIC50:  2.79E+4nM. Assay description: This cell based assay measures the ability of compounds to inhibit the constitutive cAMP activity of GPR6 receptor expressed in CHO-K1 cells. CHO cel...
Ligand InfoPC cidPC sid
In DepthDetails US Patent