BDBM232201 (E)-N-Hexyl-3-(3,4,5-trimethoxyphenyl) acrylamide (1d)
SMILES CCCCCCNC(=O)\C=C\c1cc(OC)c(OC)c(OC)c1
InChI Key InChIKey=UAMZZQXBEAJARQ-MDZDMXLPSA-N
Data  5 IC50
  Tab Delimited (TSV)   2D SDfile   Computed 3D by Vconf -m prep SDfile
Find this compound or compounds like it in BindingDB:
Activity Spreadsheet -- Enzyme Inhibition Constant Data from BindingDB
Found 5 hits for monomerid = 232201
Target5-hydroxytryptamine receptor 1A(Homo sapiens (Human))
Ewha Womans University
LigandPNGBDBM232201((E)-N-Hexyl-3-(3,4,5-trimethoxyphenyl) acrylamide ...)
Affinity DataIC50:  3.80E+3nMpH: 7.4 T: 2°C. Assay description: For the binding assay, aliquots of receptor membranes, 0.25 nM [3H]8-OH-DPAT (8-hydroxy-2-(di-N-propylamino)tetralin, 154.3 Ci/mM; New England Nuclea...
In DepthDetails ArticlePubMed
Target5-hydroxytryptamine receptor 2A(Homo sapiens (Human))
Ewha Womans University
LigandPNGBDBM232201((E)-N-Hexyl-3-(3,4,5-trimethoxyphenyl) acrylamide ...)
Affinity DataIC50: >1.00E+4nMpH: 7.4Assay Description:For serotonin 5-HT2A binding, an aliquot of frozen membrane from a CHO-K1 cell line expressing the human recombinant 5-HT2A receptor (PerkinElmer) an...
In DepthDetails ArticlePubMed
Target5-hydroxytryptamine receptor 7(Homo sapiens (Human))
Ewha Womans University
LigandPNGBDBM232201((E)-N-Hexyl-3-(3,4,5-trimethoxyphenyl) acrylamide ...)
Affinity DataIC50: >1.00E+4nMpH: 7.4 T: 2°C. Assay description: For receptor binding assays, human 5-HT6 and 5-HT7 serotonin receptors expressed in CHO-K1 cells (PerkinElmer) were used. For 5-HT6 receptor binding,...
In DepthDetails ArticlePubMed
Target5-hydroxytryptamine receptor 6(Homo sapiens (Human))
Ewha Womans University
LigandPNGBDBM232201((E)-N-Hexyl-3-(3,4,5-trimethoxyphenyl) acrylamide ...)
Affinity DataIC50: >1.00E+4nMpH: 7.4 T: 2°C. Assay description: For receptor binding assays, human 5-HT6 and 5-HT7 serotonin receptors expressed in CHO-K1 cells (PerkinElmer) were used. For 5-HT6 receptor binding,...
In DepthDetails ArticlePubMed
Target5-hydroxytryptamine receptor 2C(Homo sapiens (Human))
Ewha Womans University
LigandPNGBDBM232201((E)-N-Hexyl-3-(3,4,5-trimethoxyphenyl) acrylamide ...)
Affinity DataIC50: >1.00E+4nMpH: 7.4Assay Description:Frozen membranes from a stable CHO-K1 cell line expressing the human recombinant 5-HT2C receptor (PerkinElmer) were used. For the binding assay, [3H]...
In DepthDetails ArticlePubMed