BDBM287654 US10085984, Example 32::US11040034, Ex. No. 32
SMILES Fc1cc2nc(-c3cnnc(NCC(F)(F)F)c3)n(C3CC3)c2cc1F
InChI Key InChIKey=ALHYMIQYVWZAGO-UHFFFAOYSA-N
Data  4 IC50
  Tab Delimited (TSV)   2D SDfile   Computed 3D by Vconf -m prep SDfile
Find this compound or compounds like it in BindingDB:
Activity Spreadsheet -- Enzyme Inhibition Constant Data from BindingDB
Found 4 hits for monomerid = 287654
TargetCytochrome P450 11B2, mitochondrial(Homo sapiens (Human))
Viamet Pharmaceuticals (Bermuda)
US Patent
LigandPNGBDBM287654(US10085984, Example 32 | US11040034, Ex. No. 32)
Affinity DataIC50: <100nM. Assay description: V79-4 cells expressing recombinant andrenodoxin and andrenodoxin reductase with either recombinant human CYP11B2 or CYP11B1 were prepared according t...
Ligand InfoPC cidPC sid
In DepthDetails US Patent
TargetCytochrome P450 11B1, mitochondrial(Homo sapiens (Human))
Phasebio Pharmaceuticals
US Patent
LigandPNGBDBM287654(US10085984, Example 32 | US11040034, Ex. No. 32)
Affinity DataIC50:  5.50E+3nM. Assay description: Enzyme assays for inhibitor screening employed CYP11B2 and CYP11B1 enzyme enriched microsomes and were run at the Km of the respective substrates. Pr...
Ligand InfoPC cidPC sid
In DepthDetails US Patent
TargetCytochrome P450 11B2, mitochondrial(Homo sapiens (Human))
Viamet Pharmaceuticals (Bermuda)
US Patent
LigandPNGBDBM287654(US10085984, Example 32 | US11040034, Ex. No. 32)
Affinity DataIC50:  50nM. Assay description: Enzyme assays for inhibitor screening employed CYP11B2 and CYP11B1 enzyme enriched microsomes and were run at the Km of the respective substrates. Pr...
Ligand InfoPC cidPC sid
In DepthDetails US Patent
TargetCytochrome P450 11B1, mitochondrial(Homo sapiens (Human))
Phasebio Pharmaceuticals
US Patent
LigandPNGBDBM287654(US10085984, Example 32 | US11040034, Ex. No. 32)
Affinity DataIC50:  750nM. Assay description: V79-4 cells expressing recombinant andrenodoxin and andrenodoxin reductase with either recombinant human CYP11B2 or CYP11B1 were prepared according t...
Ligand InfoPC cidPC sid
In DepthDetails US Patent