BDBM292814 US10106501, Example EW
SMILES Cc1cn(Cc2c(Cl)ccc(C(=O)N3CCC(CC(O)=O)CC3)c2Cl)c2c(C)cc(nc12)C(F)(F)F
InChI Key InChIKey=KPICWCQMJHRIQZ-UHFFFAOYSA-N
Data  1 IC50
  Tab Delimited (TSV)   2D SDfile   Computed 3D by Vconf -m prep SDfile
Find this compound or compounds like it in BindingDB:
Activity Spreadsheet -- Enzyme Inhibition Constant Data from BindingDB
Found 1 hit for monomerid = 292814
TargetNuclear receptor ROR-gamma(Homo sapiens (Human))
Abbvie
US Patent
LigandPNGBDBM292814(US10106501, Example EW)
Affinity DataIC50:  300nM. Assay description: The primary screen was performed by transient transactivation assays. These cell-based assays were carried out using Cos-7 cells transfected with a c...
Ligand InfoPC cidPC sid
In DepthDetails US Patent