BDBM46186 1-(1,3-benzodioxol-5-ylmethyl)-3-[2,3-bis(2-furanyl)-6-quinoxalinyl]urea::1-(1,3-benzodioxol-5-ylmethyl)-3-[2,3-bis(furan-2-yl)quinoxalin-6-yl]urea::1-[2,3-bis(2-furyl)quinoxalin-6-yl]-3-piperonyl-urea::MLS-0202051.0001::cid_1299058
SMILES O=C(NCc1ccc2OCOc2c1)Nc1ccc2nc(-c3ccco3)c(nc2c1)-c1ccco1
InChI Key InChIKey=FJFWBXPNYHHTEH-UHFFFAOYSA-N
Data  2 IC50
  Tab Delimited (TSV)   2D SDfile   Computed 3D by Vconf -m prep SDfile
Find this compound or compounds like it in BindingDB:
Activity Spreadsheet -- Enzyme Inhibition Constant Data from BindingDB
Found 2 hits for monomerid = 46186
TargetTyrosine-protein phosphatase non-receptor type 7(Homo sapiens (Human))
Burnham Center For Chemical Genomics
Curated by PubChem BioAssay
LigandPNGBDBM46186(1-(1,3-benzodioxol-5-ylmethyl)-3-[2,3-bis(2-furany...)
Affinity DataIC50:  2.15E+3nM. Assay description: Data Source: Sanford-Burnham Center for Chemical Genomics (SBCCG) Source Affiliation: Sanford-Burnham Medical Research Institute (SBMRI, San Diego, C...
In DepthDetails PCBioAssay
TargetTyrosine-protein phosphatase non-receptor type 7(Homo sapiens (Human))
Burnham Center For Chemical Genomics
Curated by PubChem BioAssay
LigandPNGBDBM46186(1-(1,3-benzodioxol-5-ylmethyl)-3-[2,3-bis(2-furany...)
Affinity DataIC50:  2.47E+3nM. Assay description: Data Source: Sanford-Burnham Center for Chemical Genomics (SBCCG) Source Affiliation: Sanford-Burnham Medical Research Institute (SBMRI, San Diego, C...
In DepthDetails PCBioAssay