BDBM50003779 8-(4-Chloro-benzenesulfonylamino)-6-pyridin-3-ylmethyl-octanoic acid::CHEMBL337331
SMILES OC(=O)CCCCC(CCNS(=O)(=O)c1ccc(Cl)cc1)Cc1cccnc1
InChI Key InChIKey=VKSPBMJCOLSERQ-UHFFFAOYSA-N
Data  1 IC50
  Tab Delimited (TSV)   2D SDfile   Computed 3D by Vconf -m prep SDfile
Find this compound or compounds like it in BindingDB:
Activity Spreadsheet -- Enzyme Inhibition Constant Data from BindingDB
Found 1 hit for monomerid = 50003779
TargetThromboxane-A synthase(Homo sapiens (Human))
Ciba-Geigy
Curated by ChEMBL
LigandPNGBDBM50003779(8-(4-Chloro-benzenesulfonylamino)-6-pyridin-3-ylme...)
Affinity DataIC50:  14nM. Assay description: The compound was tested in vitro for its inhibitory activity against thromboxane synthase A2 (TXA2)
In DepthDetails ArticlePubMed