BDBM50003781 CHEMBL341686::[5-(4-Chloro-benzenesulfonylamino)-1-(3-pyridin-3-yl-propyl)-pentylsulfanyl]-acetic acid
SMILES OC(=O)CSC(CCCCNS(=O)(=O)c1ccc(Cl)cc1)CCCc1cccnc1
InChI Key InChIKey=HYBZRSVSWNULCR-UHFFFAOYSA-N
Data  1 IC50
  Tab Delimited (TSV)   2D SDfile   Computed 3D by Vconf -m prep SDfile
Find this compound or compounds like it in BindingDB:
Activity Spreadsheet -- Enzyme Inhibition Constant Data from BindingDB
Found 1 hit for monomerid = 50003781
TargetThromboxane-A synthase(Homo sapiens (Human))
Ciba-Geigy
Curated by ChEMBL
LigandPNGBDBM50003781(CHEMBL341686 | [5-(4-Chloro-benzenesulfonylamino)-...)
Affinity DataIC50:  2nM. Assay description: In vitro inhibition of Thromboxane A2 synthase
In DepthDetails ArticlePubMed