BDBM50004780 3-[18-(2-Carboxy-ethyl)-8,13-bis-(1,2-diacetoxy-ethyl)-3,7,12,17-tetramethyl-22,24-dihydro-porphin-2-yl]-propionic acid;Mn complex::CHEMBL432254
SMILES CC1=C(CCC(O)=O)\C2=C\c3c(CCC(O)=O)c(C)c4\C=C5/N=C(/C=c6/c(C(COC(=O)C7=CC7)OC(=O)C7=CC7)c(C)\c(=C\C1=N2)n6[Mn]n34)C(C)=C5C(COC(=O)C1=CC1)OC(=O)C1C=C1
InChI Key InChIKey=VJCVPVPTDIPIOL-ZGDZQCJBSA-L
Data  1 KI  5 IC50
  Tab Delimited (TSV)   2D SDfile   Computed 3D by Vconf -m prep SDfile
Find this compound or compounds like it in BindingDB:
Activity Spreadsheet -- Enzyme Inhibition Constant Data from BindingDB
Found 6 hits for monomerid = 50004780
TargetGag-Pol polyprotein [489-587](Human immunodeficiency virus type 1)
University Of California
Curated by ChEMBL
LigandPNGBDBM50004780(3-[18-(2-Carboxy-ethyl)-8,13-bis-(1,2-diacetoxy-et...)
Affinity DataKi:  85nM. Assay description: Binding affinity against HIV-1 protease
In DepthDetails ArticlePubMed
TargetGag-Pol polyprotein [489-587](Human immunodeficiency virus type 1)
University Of California
Curated by ChEMBL
LigandPNGBDBM50004780(3-[18-(2-Carboxy-ethyl)-8,13-bis-(1,2-diacetoxy-et...)
Affinity DataIC50:  6.50E+4nM. Assay description: Inhibition of HIV-1 protease in 10% fetal calf serum(FCS)
In DepthDetails ArticlePubMed
TargetGag-Pol polyprotein [489-587](Human immunodeficiency virus type 1)
University Of California
Curated by ChEMBL
LigandPNGBDBM50004780(3-[18-(2-Carboxy-ethyl)-8,13-bis-(1,2-diacetoxy-et...)
Affinity DataIC50:  400nM. Assay description: Inhibition of HIV-1 protease in 5%DMSO
In DepthDetails ArticlePubMed
TargetGag-Pol polyprotein [489-587](Human immunodeficiency virus type 1)
University Of California
Curated by ChEMBL
LigandPNGBDBM50004780(3-[18-(2-Carboxy-ethyl)-8,13-bis-(1,2-diacetoxy-et...)
Affinity DataIC50:  100nM. Assay description: Inhibitory concentration against HIV-1 protease in the absence of DMSO
In DepthDetails ArticlePubMed
TargetGenome polyprotein(Human rhinovirus B)
University Of California
Curated by ChEMBL
LigandPNGBDBM50004780(3-[18-(2-Carboxy-ethyl)-8,13-bis-(1,2-diacetoxy-et...)
Affinity DataIC50:  1.20E+3nM. Assay description: In vitro Inhibitory activity against HIV-2 protease in the presence of 5%DMSO
In DepthDetails ArticlePubMed
TargetGenome polyprotein(Human rhinovirus B)
University Of California
Curated by ChEMBL
LigandPNGBDBM50004780(3-[18-(2-Carboxy-ethyl)-8,13-bis-(1,2-diacetoxy-et...)
Affinity DataIC50:  700nM. Assay description: Inhibition of HIV-1 protease in 10% fetal calf serum(FCS)
In DepthDetails ArticlePubMed