BDBM50012504 2-{5-[(2-Methyl-4-oxo-3,4-dihydro-quinazolin-6-ylmethyl)-prop-2-ynyl-amino]-1-oxo-1,3-dihydro-isoindol-2-yl}-pentanedioic acid::CHEMBL74059
SMILES Cc1nc2ccc(CN(CC#C)c3ccc4C(=O)N(Cc4c3)[C@@H](CCC(O)=O)C(O)=O)cc2c(=O)[nH]1
InChI Key InChIKey=JYWGZDPFGUHAIB-QFIPXVFZSA-N
Data  1 IC50
  Tab Delimited (TSV)   2D SDfile   Computed 3D by Vconf -m prep SDfile
Find this compound or compounds like it in BindingDB:
Activity Spreadsheet -- Enzyme Inhibition Constant Data from BindingDB
Found 1 hit for monomerid = 50012504
TargetThymidylate synthase(Mus musculus)
Ici Pharmaceuticals Group
Curated by ChEMBL
LigandPNGBDBM50012504(2-{5-[(2-Methyl-4-oxo-3,4-dihydro-quinazolin-6-ylm...)
Affinity DataIC50:  150nM. Assay description: In vitro inhibition of the compound against L1210 thymidylate synthase (TS)
In DepthDetails ArticlePubMed