BDBM50032568 CHEMBL78627::[5-Hydroxy-1-(2-morpholin-4-yl-ethyl)-1H-indol-3-yl]-naphthalen-1-yl-methanone
SMILES Oc1ccc2n(CCN3CCOCC3)cc(C(=O)c3cccc4ccccc34)c2c1
InChI Key InChIKey=VTWRVIWPNCLGLT-UHFFFAOYSA-N
Data  4 KI  1 IC50  1 EC50
  Tab Delimited (TSV)   2D SDfile   Computed 3D by Vconf -m prep SDfile
Find this compound or compounds like it in BindingDB:
Activity Spreadsheet -- Enzyme Inhibition Constant Data from BindingDB
Found 6 hits for monomerid = 50032568
TargetCannabinoid receptor 2(Homo sapiens (Human))
University Of Otago
Curated by ChEMBL
LigandPNGBDBM50032568(CHEMBL78627 | [5-Hydroxy-1-(2-morpholin-4-yl-ethyl...)
Affinity DataKi:  169nM. Assay description: Displacement of [3H]CP55,940 from N-terminal HA-tagged human CB2 receptor expressed in HEK293 cell membranes after 1 hr by microbeta scintillation co...
In DepthDetails ArticlePubMed
TargetCannabinoid receptor 1(Homo sapiens (Human))
University Of Otago
Curated by ChEMBL
LigandPNGBDBM50032568(CHEMBL78627 | [5-Hydroxy-1-(2-morpholin-4-yl-ethyl...)
Affinity DataKi:  2.84E+3nM. Assay description: Displacement of [3H]CP55,940 from N-terminal HA-tagged human CB1 receptor expressed in HEK293 cell membranes after 1 hr by microbeta scintillation co...
In DepthDetails ArticlePubMed
TargetCannabinoid receptor 1(Rattus norvegicus (rat))
Sanofi Research Division
Curated by ChEMBL
LigandPNGBDBM50032568(CHEMBL78627 | [5-Hydroxy-1-(2-morpholin-4-yl-ethyl...)
Affinity DataKi:  1.82E+7nM. Assay description: Cannabinoid receptor 1 binding affinity by measuring its ability to displace [3H]WIN-55212-2 in rat forebrain membranes
In DepthDetails ArticlePubMed
TargetCannabinoid receptor 1(Rattus norvegicus (rat))
Sanofi Research Division
Curated by ChEMBL
LigandPNGBDBM50032568(CHEMBL78627 | [5-Hydroxy-1-(2-morpholin-4-yl-ethyl...)
Affinity DataKi:  1.82E+7nM. Assay description: Binding affinity at cannabinoid receptor 1 using rat brain membranes
In DepthDetails ArticlePubMed
TargetCannabinoid receptor 1(Rattus norvegicus (rat))
Sanofi Research Division
Curated by ChEMBL
LigandPNGBDBM50032568(CHEMBL78627 | [5-Hydroxy-1-(2-morpholin-4-yl-ethyl...)
Affinity DataIC50:  70nM. Assay description: Concentration of compound required to inhibit 50% of [3H]-WIN- 55212 binding to Cannabinoid receptor 1 in rat cerebellum membranes.
In DepthDetails ArticlePubMed
TargetCannabinoid receptor 2(Homo sapiens (Human))
University Of Otago
Curated by ChEMBL
LigandPNGBDBM50032568(CHEMBL78627 | [5-Hydroxy-1-(2-morpholin-4-yl-ethyl...)
Affinity DataEC50:  8.70nM. Assay description: Agonist activity at N-terminal HA-tagged human CB2 receptor expressed in HEK293 cells transfected with YFP-Epac-RLuc assessed as decrease in forskoli...
In DepthDetails ArticlePubMed