BDBM50098846 2-[5-Amino-2-(4-fluoro-phenyl)-6-oxo-6H-pyrimidin-1-yl]-N-[1-benzyl-2-oxo-2-(5-phenyl-benzooxazol-2-yl)-ethyl]-acetamide::CHEMBL286319
SMILES Nc1cnc(-c2ccc(F)cc2)n(CC(=O)NC(Cc2ccccc2)C(=O)c2nc3cc(ccc3o2)-c2ccccc2)c1=O
InChI Key InChIKey=XFDZXYJVOIPVDN-UHFFFAOYSA-N
Data  2 KI
  Tab Delimited (TSV)   2D SDfile   Computed 3D by Vconf -m prep SDfile
Find this compound or compounds like it in BindingDB:
Activity Spreadsheet -- Enzyme Inhibition Constant Data from BindingDB
Found 2 hits for monomerid = 50098846
TargetChymase(Homo sapiens (Human))
Welfide
Curated by ChEMBL
LigandPNGBDBM50098846(2-[5-Amino-2-(4-fluoro-phenyl)-6-oxo-6H-pyrimidin-...)
Affinity DataKi:  174nM. Assay description: inhibitory activity was evaluated against chymase from human heart.
In DepthDetails ArticlePubMed
TargetChymotrypsin-C(Homo sapiens (Human))
Welfide
Curated by ChEMBL
LigandPNGBDBM50098846(2-[5-Amino-2-(4-fluoro-phenyl)-6-oxo-6H-pyrimidin-...)
Affinity DataKi:  1.63E+3nM. Assay description: Inhibitory activity against alpha chymotrypsin from bovine pancreas.
In DepthDetails ArticlePubMed