BDBM50186686 CHEMBL204992::benzenesulfonyl-Glu(OtBu)-Ser-LeuVSMe
SMILES CC(C)C[C@H](NC(=O)[C@H](CO)NC(=O)[C@H](CCC(=O)OC(C)(C)C)NS(=O)(=O)c1ccccc1)\C=C\S(C)(=O)=O
InChI Key InChIKey=ROXPOWPSGQTUTL-RSYYUITASA-N
Data  3 IC50
  Tab Delimited (TSV)   2D SDfile   Computed 3D by Vconf -m prep SDfile
Find this compound or compounds like it in BindingDB:
Activity Spreadsheet -- Enzyme Inhibition Constant Data from BindingDB
Found 3 hits for monomerid = 50186686
TargetProteasome subunit beta type-5(Homo sapiens (Human))
Celera
Curated by ChEMBL
LigandPNGBDBM50186686(CHEMBL204992 | benzenesulfonyl-Glu(OtBu)-Ser-LeuVS...)
Affinity DataIC50:  1.10nM. Assay description: Inhibition of chymotrypsin-like proteasome activity of human 20S proteasome
In DepthDetails ArticlePubMed
TargetProteasome subunit beta type-2(Homo sapiens (Human))
Celera
Curated by ChEMBL
LigandPNGBDBM50186686(CHEMBL204992 | benzenesulfonyl-Glu(OtBu)-Ser-LeuVS...)
Affinity DataIC50: >4.50E+5nM. Assay description: Inhibition of trypsin-like proteasome activity of human 20S proteasome
In DepthDetails ArticlePubMed
TargetProteasome subunit beta type-1(Homo sapiens (Human))
Celera
Curated by ChEMBL
LigandPNGBDBM50186686(CHEMBL204992 | benzenesulfonyl-Glu(OtBu)-Ser-LeuVS...)
Affinity DataIC50: >4.50E+5nM. Assay description: Inhibition of post glutamyl peptide hydrolase-like proteasome activity of human 20S proteasome
In DepthDetails ArticlePubMed