BDBM50228895 CHEMBL107828
SMILES OC(=O)[C@H]1Cc2c(CN1C(=O)C(c1ccccc1)c1ccccc1)ncn2Cc1ccccc1
InChI Key InChIKey=ZWBCMWXJAMFLQL-RUZDIDTESA-N
Data  1 IC50
  Tab Delimited (TSV)   2D SDfile   Computed 3D by Vconf -m prep SDfile
Find this compound or compounds like it in BindingDB:
Activity Spreadsheet -- Enzyme Inhibition Constant Data from BindingDB
Found 1 hit for monomerid = 50228895
LigandPNGBDBM50228895(CHEMBL107828)
Affinity DataIC50:  1.20E+3nM. Assay description: Binding affinity against Angiotensin II receptor, from rat adrenal gland
In DepthDetails ArticlePubMed