BDBM50229016 CHEMBL109979
SMILES Cc1ccc(Cn2cnc3CN([C@@H](Cc23)C(O)=O)C(=O)C(c2ccccc2)c2ccccc2)cc1C
InChI Key InChIKey=HAESDYUPXFHGPG-MHZLTWQESA-N
Data  1 IC50
  Tab Delimited (TSV)   2D SDfile   Computed 3D by Vconf -m prep SDfile
Find this compound or compounds like it in BindingDB:
Activity Spreadsheet -- Enzyme Inhibition Constant Data from BindingDB
Found 1 hit for monomerid = 50229016
LigandPNGBDBM50229016(CHEMBL109979)
Affinity DataIC50:  300nM. Assay description: Binding affinity against Angiotensin II receptor, from rat adrenal gland
In DepthDetails ArticlePubMed