BDBM50230091 CHEMBL340316
SMILES CCCCc1ncc(\C(C)=C(/Cc2ccccc2)C(O)=O)n1Cc1ccccc1Cl
InChI Key InChIKey=SNKQAPAXVLAKHS-DYTRJAOYSA-N
Data  1 IC50
  Tab Delimited (TSV)   2D SDfile   Computed 3D by Vconf -m prep SDfile
Find this compound or compounds like it in BindingDB:
Activity Spreadsheet -- Enzyme Inhibition Constant Data from BindingDB
Found 1 hit for monomerid = 50230091
LigandPNGBDBM50230091(CHEMBL340316)
Affinity DataIC50:  2.84E+4nM. Assay description: Compound was tested in vitro for binding affinity against human carbonic anhydrase II; (ki*10e-9)
In DepthDetails ArticlePubMed