BDBM50249577 CHEMBL4072531::US10729695, Compound CB-4
SMILES OC(Cn1ccc2ccccc12)Cn1cnc2ccccc12
InChI Key InChIKey=HLMIKNQKYHOLTJ-UHFFFAOYSA-N
Data  2 Kd
  Tab Delimited (TSV)   2D SDfile   Computed 3D by Vconf -m prep SDfile
Find this compound or compounds like it in BindingDB:
Activity Spreadsheet -- Enzyme Inhibition Constant Data from BindingDB
Found 2 hits for monomerid = 50249577
TargetAdvanced glycosylation end product-specific receptor(Homo sapiens (Human))
The Research Foundation For The State University Of New York
US Patent
LigandPNGBDBM50249577(CHEMBL4072531 | US10729695, Compound CB-4)
Affinity DataKd:  2nM. Assay description: Day 1Step 1. Add 50 μl anti-mDial (1:160 dilution in 0.1M NaHCO3 pH 9.6)/well. Incubate overnight at 4° C.Day 2Step 2. Use the plate washer to a...
In DepthDetails US Patent
TargetAdvanced glycosylation end product-specific receptor(Homo sapiens (Human))
The Research Foundation For The State University Of New York
US Patent
LigandPNGBDBM50249577(CHEMBL4072531 | US10729695, Compound CB-4)
Affinity DataKd:  2nM. Assay description: Binding affinity to human RAGE cytoplasmic domain by tryptophan fluorescence assay
In DepthDetails ArticlePubMed