BDBM50314814 2-((3-((2-(4-chlorophenyl)-5-methyloxazol-4-yl)methoxy)benzyl)(p-tolyloxycarbonyl)amino)acetic acid::2-((3-((2-(4-chlorophenyl)-5-methyloxazol-4-yl)methoxy)benzyl)(ptolyloxycarbonyl)amino)acetic acid::CHEMBL1089210::N-(3-{[2-(4-chlorophenyl)-5-methyl-1,3-oxazol-4-yl]methoxy}benzyl)-N-[(4-methylphenoxy)carbonyl]glycine
SMILES Cc1oc(nc1COc1cccc(CN(CC(O)=O)C(=O)Oc2ccc(C)cc2)c1)-c1ccc(Cl)cc1
InChI Key InChIKey=HUZRXZVIBUNCKL-UHFFFAOYSA-N
Data  4 IC50  4 EC50
PDB links: 1 PDB ID matches this monomer.
  Tab Delimited (TSV)   2D SDfile   Computed 3D by Vconf -m prep SDfile
Find this compound or compounds like it in BindingDB:
Activity Spreadsheet -- Enzyme Inhibition Constant Data from BindingDB
Found 8 hits for monomerid = 50314814
TargetPeroxisome proliferator-activated receptor gamma(Homo sapiens (Human))
Bristol-Myers Squibb R & D
Curated by ChEMBL
LigandPNGBDBM50314814(2-((3-((2-(4-chlorophenyl)-5-methyloxazol-4-yl)met...)
Affinity DataEC50:  963nM. Assay description: Agonist activity against human Gal4-fussed PPARgamma in HEK293 cells by luciferase reporter gene assay
In DepthDetails ArticlePubMed
TargetPeroxisome proliferator-activated receptor alpha(Homo sapiens (Human))
Bristol-Myers Squibb R & D
Curated by ChEMBL
LigandPNGBDBM50314814(2-((3-((2-(4-chlorophenyl)-5-methyloxazol-4-yl)met...)
Affinity DataEC50:  8nM. Assay description: Agonist activity against human Gal4-fussed PPARalpha in HEK293 cells by luciferase reporter gene assay
TargetPeroxisome proliferator-activated receptor alpha(Homo sapiens (Human))
Bristol-Myers Squibb R & D
Curated by ChEMBL
LigandPNGBDBM50314814(2-((3-((2-(4-chlorophenyl)-5-methyloxazol-4-yl)met...)
Affinity DataIC50:  347nM. Assay description: Binding affinity to human His-tagged PPARalpha LBD (E196-Y468) expressed in Escherichia coli BL21 (DE3) by fluorescence polarization assay
TargetPeroxisome proliferator-activated receptor gamma(Homo sapiens (Human))
Bristol-Myers Squibb R & D
Curated by ChEMBL
LigandPNGBDBM50314814(2-((3-((2-(4-chlorophenyl)-5-methyloxazol-4-yl)met...)
Affinity DataEC50:  1.32E+3nM. Assay description: Agonist activity at human PPARgamma LBD (176-477) expressed in HEK293 cells coexpressing GAL4-DBD by transactivation assay
In DepthDetails ArticlePubMed
TargetPeroxisome proliferator-activated receptor gamma(Homo sapiens (Human))
Bristol-Myers Squibb R & D
Curated by ChEMBL
LigandPNGBDBM50314814(2-((3-((2-(4-chlorophenyl)-5-methyloxazol-4-yl)met...)
Affinity DataIC50:  2.79E+3nM. Assay description: Binding affinity to human His-tagged PPARgamma LBD (Q203-Y477) expressed in Escherichia coli BL21 (DE3) by fluorescence polarization assay
In DepthDetails ArticlePubMed
TargetCytochrome P450 2C9(Homo sapiens (Human))
Bristol-Myers Squibb
Curated by ChEMBL
LigandPNGBDBM50314814(2-((3-((2-(4-chlorophenyl)-5-methyloxazol-4-yl)met...)
Affinity DataIC50:  1.20E+3nM. Assay description: Inhibition of CYP2C9
In DepthDetails ArticlePubMed
TargetPotassium voltage-gated channel subfamily H member 2(Homo sapiens (Human))
Bristol-Myers Squibb
Curated by ChEMBL
LigandPNGBDBM50314814(2-((3-((2-(4-chlorophenyl)-5-methyloxazol-4-yl)met...)
Affinity DataIC50:  2.93E+4nM. Assay description: Inhibition of human ERG by electrophysiology assay
In DepthDetails ArticlePubMed
TargetPeroxisome proliferator-activated receptor alpha(Homo sapiens (Human))
Bristol-Myers Squibb R & D
Curated by ChEMBL
LigandPNGBDBM50314814(2-((3-((2-(4-chlorophenyl)-5-methyloxazol-4-yl)met...)
Affinity DataEC50:  8.80nM. Assay description: Agonist activity at human PPARalpha LBD (167-468) expressed in HEK293 cells coexpressing GAL4-DBD by transactivation assay