BDBM50400182 2,3‐dihydroxyanthracene‐9,10‐dione (Ligand 2)::CHEMBL2180322
SMILES Oc1cc2C(=O)c3ccccc3C(=O)c2cc1O
InChI Key InChIKey=KQSBZNJFKWOQQK-UHFFFAOYSA-N
Data  2 KI  1 Kd  1 ITC
  Tab Delimited (TSV)   2D SDfile   Computed 3D by Vconf -m prep SDfile
Find this compound or compounds like it in BindingDB:
Activity Spreadsheet -- Enzyme Inhibition Constant Data from BindingDB
Found 3 hits for monomerid = 50400182
TargetInduced myeloid leukemia cell differentiation protein Mcl-1(Homo sapiens (Human))
Dalian University Of Technology
Curated by ChEMBL
LigandPNGBDBM50400182(2,3‐dihydroxyanthracene‐9,10‐dio...)
Affinity DataKi:  312nM. Assay description: Binding affinity to Mcl-1 after 30 mins by florescence polarization assay
In DepthDetails ArticlePubMed
TargetApoptosis regulator Bcl-2(Homo sapiens (Human))
Dalian University Of Technology
Curated by ChEMBL
LigandPNGBDBM50400182(2,3‐dihydroxyanthracene‐9,10‐dio...)
Affinity DataKi:  420nM. Assay description: Binding affinity to Bcl-2 after 30 mins by florescence polarization assay
In DepthDetails ArticlePubMed
TargetInduced myeloid leukemia cell differentiation protein Mcl-1 [172-327](Homo sapiens (Human))
Dalian University Of Technology
LigandPNGBDBM50400182(2,3‐dihydroxyanthracene‐9,10‐dio...)
Affinity DataKd:  1.85E+3nMpH: 8.0 T: 2°C. Assay description: ITC experiments were carried out using iTC200 (Microcal LLC, Northampton, MA, USA) with each of the compounds 1-6 and Mcl-1 protein. The heat of rea...
In DepthDetails ArticlePubMed
Activity Spreadsheet -- ITC Data from BindingDB
Found 1 hit for monomerid = 50400182
CellInduced myeloid leukemia cell differentiation protein Mcl-1 (aa 172-327)(Homo sapiens (Human))
Dalian University Of Technology
SyringePNGBDBM50400182(2,3‐dihydroxyanthracene‐9,10‐dio...)
ITC DataΔG°: -7.86kcal/mole −TΔS°: -1.75kcal/mole ΔH°: -6.09kcal/mole logk: 5.81E+5
pH: 8.0 T: 25.00°C
In DepthDetails ArticlePubMed